Target
Cathepsin K
Ligand
BDBM50306309
Substrate
Meas. Tech.
ChEMBL_609281 (CHEMBL1070042)
IC50
0.2±n/a nM
Citation
Target
Name:
Cathepsin K
Synonyms:
CATK_HUMAN CTSO Cathepsin O Cathepsin X
Type:
Enzyme
Mol. Mass.:
36975.68
Organism:
Homo sapiens (Human)
Description:
P43235
Residue:
329
  
Inhibitor
Name:
BDBM50306309
Synonyms:
1-(4'-((S)-1-((S)-1-(1-cyanocyclopropylamino)-4-fluoro-4-methyl-1-oxopentan-2-ylamino)-2,2,2-trifluoroethyl)biphenyl-4-yl)cyclopropanecarboxamide | CHEMBL598502
Type:
Small organic molecule
Emp. Form.:
C28H30F4N4O2
Mol. Mass.:
530.557
SMILES:
CC(C)(F)C[C@H](N[C@@H](c1ccc(cc1)-c1ccc(cc1)C1(CC1)C(N)=O)C(F)(F)F)C(=O)NC1(CC1)C#N
: