Target
11-beta-hydroxysteroid dehydrogenase 1
Ligand
BDBM50306418
Substrate
Meas. Tech.
ChEMBL_609881 (CHEMBL1073437)
IC50
41.6±n/a nM
Citation
 Tice, CMZhao, WXu, ZCacatian, STSimpson, RDYe, YJSingh, SBMcKeever, BMLindblom, PGuo, JKrosky, PMKruk, BABerbaum, JHarrison, RKJohnson, JJBukhtiyarov, YPanemangalore, RScott, BBZhao, YBruno, JGZhuang, LMcGeehan, GMHe, WClaremon, DA Spirocyclic ureas: orally bioavailable 11beta-HSD1 inhibitors identified by computer-aided drug design. Bioorg Med Chem Lett 20:881-6 (2010)  
Target
Name:
11-beta-hydroxysteroid dehydrogenase 1
Synonyms:
11-DH 11-beta-Hydroxysteroid Dehydrogenase 1 (11-beta-HSD1) 11-beta-hydroxysteroid dehydrogenase 1 (11HSD1) Corticosteroid 11-beta-dehydrogenase isozyme 1 (11-beta-HSD-1) Corticosteroid 11-beta-dehydrogenase isozyme 1 (11beta-HSD1) HSD11 HSD11L | SDR26C1
Type:
Enzyme
Mol. Mass.:
32409.16
Organism:
Homo sapiens (Human)
Description:
P28845
Residue:
292
  
Inhibitor
Name:
BDBM50306418
Synonyms:
4-Phenyl-piperidine-1,4-dicarboxylic acid 1-adamantan-2-ylamide 4-amide | CHEMBL605536
Type:
Small organic molecule
Emp. Form.:
C23H31N3O2
Mol. Mass.:
381.5111
SMILES:
NC(=O)C1(CCN(CC1)C(=O)NC1C2CC3CC(C2)CC1C3)c1ccccc1
: