Target
11-beta-hydroxysteroid dehydrogenase 1
Ligand
BDBM50306427
Substrate
Meas. Tech.
ChEMBL_609881 (CHEMBL1073437)
IC50
3.4±n/a nM
Citation
 Tice, CMZhao, WXu, ZCacatian, STSimpson, RDYe, YJSingh, SBMcKeever, BMLindblom, PGuo, JKrosky, PMKruk, BABerbaum, JHarrison, RKJohnson, JJBukhtiyarov, YPanemangalore, RScott, BBZhao, YBruno, JGZhuang, LMcGeehan, GMHe, WClaremon, DA Spirocyclic ureas: orally bioavailable 11beta-HSD1 inhibitors identified by computer-aided drug design. Bioorg Med Chem Lett 20:881-6 (2010)  
Target
Name:
11-beta-hydroxysteroid dehydrogenase 1
Synonyms:
11-DH 11-beta-Hydroxysteroid Dehydrogenase 1 (11-beta-HSD1) 11-beta-hydroxysteroid dehydrogenase 1 (11HSD1) Corticosteroid 11-beta-dehydrogenase isozyme 1 (11-beta-HSD-1) Corticosteroid 11-beta-dehydrogenase isozyme 1 (11beta-HSD1) HSD11 HSD11L | SDR26C1
Type:
Enzyme
Mol. Mass.:
32409.16
Organism:
Homo sapiens (Human)
Description:
P28845
Residue:
292
  
Inhibitor
Name:
BDBM50306427
Synonyms:
2-{1'-[(adamantan-2-yl)carbamoyl]-6-chloro-2,3-dihydrospiro[indene-1,4'-piperidine]-3-yl}acetic acid | CHEMBL602051
Type:
Small organic molecule
Emp. Form.:
C26H33ClN2O3
Mol. Mass.:
457.005
SMILES:
OC(=O)CC1CC2(CCN(CC2)C(=O)NC2C3CC4CC(C3)CC2C4)c2cc(Cl)ccc12
: