Target
Cannabinoid receptor 1
Ligand
BDBM50306528
Substrate
Meas. Tech.
ChEMBL_610611 (CHEMBL1069625)
Ki
0.24±n/a nM
Citation
 Burdick, DDeOrazio, RGuzzo, PHabershaw, AHelle, MPaul, BWolf, M Synthesis and structure-activity relationship of substitutions at the C-1 position of Delta9-tetrahydrocannabinol. Bioorg Med Chem Lett 20:1424-6 (2010)  
Target
Name:
Cannabinoid receptor 1
Synonyms:
CANN6 CB-R CNR CNR1_HUMAN Cannabinoid receptor Cannabinoid receptor 1 (brain)
Type:
G Protein-Coupled Receptor (GPCR)
Mol. Mass.:
52868.96
Organism:
Homo sapiens (Human)
Description:
P21554
Residue:
472
  
Inhibitor
Name:
BDBM50306528
Synonyms:
(6aR,10aR)-6,6,9-trimethyl-3-(2-methyloctan-2-yl)-6a,7,8,10a-tetrahydro-6H-benzo[c]chromen-1-ol | CHEMBL600602
Type:
Small organic molecule
Emp. Form.:
C25H38O2
Mol. Mass.:
370.568
SMILES:
CCCCCCC(C)(C)c1cc(O)c2[C@@H]3C=C(C)CC[C@H]3C(C)(C)Oc2c1
: