Target
Glycogen phosphorylase, muscle form
Ligand
BDBM50057731
Substrate
Meas. Tech.
ChEMBL_610888 (CHEMBL1065043)
Ki
16000±n/a nM
Citation
 Bokor, EDocsa, TGergely, PSomsák, L Synthesis of 1-(D-glucopyranosyl)-1,2,3-triazoles and their evaluation as glycogen phosphorylase inhibitors. Bioorg Med Chem 18:1171-80 (2010)  
Target
Name:
Glycogen phosphorylase, muscle form
Synonyms:
Glycogen Phosphorylase (PYGM) Glycogen phosphorylase, muscle form PYGM | PYGM_RABIT
Type:
Enzyme
Mol. Mass.:
97296.32
Organism:
Oryctolagus cuniculus (rabbit)
Description:
Phosphorylation of Ser-15 converts phosphorylase B (unphosphorylated) to phosphorylase A.
Residue:
843
  
Inhibitor
Name:
BDBM50057731
Synonyms:
(2-Carbamoyl-3,4,5-trihydroxy-6-hydroxymethyl-tetrahydro-pyran-2-yl)-carbamic acid methyl ester | CHEMBL133097
Type:
Small organic molecule
Emp. Form.:
C9H16N2O8
Mol. Mass.:
280.2319
SMILES:
COC(=O)N[C@@]1(O[C@H](CO)[C@@H](O)[C@H](O)[C@H]1O)C(N)=O
: