Target
Glycogen phosphorylase, muscle form
Ligand
BDBM50306562
Substrate
Meas. Tech.
ChEMBL_610891 (CHEMBL1065046)
Ki
370000±n/a nM
Citation
 Bokor, EDocsa, TGergely, PSomsák, L Synthesis of 1-(D-glucopyranosyl)-1,2,3-triazoles and their evaluation as glycogen phosphorylase inhibitors. Bioorg Med Chem 18:1171-80 (2010)  
Target
Name:
Glycogen phosphorylase, muscle form
Synonyms:
Glycogen Phosphorylase (PYGM) Glycogen phosphorylase, muscle form PYGM | PYGM_RABIT
Type:
Enzyme
Mol. Mass.:
97296.32
Organism:
Oryctolagus cuniculus (rabbit)
Description:
Phosphorylation of Ser-15 converts phosphorylase B (unphosphorylated) to phosphorylase A.
Residue:
843
  
Inhibitor
Name:
BDBM50306562
Synonyms:
(2S,3R,4S,5S,6R)-3,4,5-trihydroxy-6-(hydroxymethyl)tetrahydro-2H-pyran-2-carboxamide ALPHA-D-GLUCOPYRANOSYL-2-CARBOXYLIC ACID AMIDE | CHEMBL135302
Type:
Small organic molecule
Emp. Form.:
C7H13NO6
Mol. Mass.:
207.1812
SMILES:
NC(=O)[C@H]1O[C@H](CO)[C@@H](O)[C@H](O)[C@H]1O
: