Target
Monoacylglycerol lipase ABHD6
Ligand
BDBM50307086
Substrate
Meas. Tech.
ChEMBL_609360 (CHEMBL1072746)
IC50
60±n/a nM
Citation
 Long, JZJin, XAdibekian, ALi, WCravatt, BF Characterization of tunable piperidine and piperazine carbamates as inhibitors of endocannabinoid hydrolases. J Med Chem 53:1830-42 (2010)  
Target
Name:
Monoacylglycerol lipase ABHD6
Synonyms:
ABHD6_MOUSE Abhd6 Monoacylglycerol lipase ABHD6
Type:
Single-pass type II membrane protein; hydrolase
Mol. Mass.:
38216.17
Organism:
Mus musculus (mouse)
Description:
Assays were using membranes of recombinant Abh6 transiently transfected in COS-7 cells.
Residue:
336
  
Inhibitor
Name:
BDBM50307086
Synonyms:
4-Nitrophenyl 4-(3-(Pyridin-2-yloxy)benzyl)piperazine-1-carboxylate | CHEMBL600429
Type:
Small organic molecule
Emp. Form.:
C23H22N4O5
Mol. Mass.:
434.4446
SMILES:
[O-][N+](=O)c1ccc(OC(=O)N2CCN(Cc3cccc(Oc4ccccn4)c3)CC2)cc1
: