Target
D(3) dopamine receptor
Ligand
BDBM50020222
Substrate
Meas. Tech.
ChEMBL_612618 (CHEMBL1065655)
Ki
2.35±n/a nM
Citation
 Ghosh, BAntonio, TReith, MEDutta, AK Discovery of 4-(4-(2-((5-Hydroxy-1,2,3,4-tetrahydronaphthalen-2-yl)(propyl)amino)ethyl)piperazin-1-yl)quinolin-8-ol and its analogues as highly potent dopamine D2/D3 agonists and as iron chelator: in vivo activity indicates potential application in symptomatic and neuroprotective therapy for Parkin J Med Chem 53:2114-25 (2010)  
Target
Name:
D(3) dopamine receptor
Synonyms:
DOPAMINE D3 DRD3_HUMAN Dopamine D3 receptor (D3) Dopamine receptor Dopamine receptor D3
Type:
Mol. Mass.:
44243.43
Organism:
Homo sapiens (Human)
Description:
Residue:
400
  
Inhibitor
Name:
BDBM50020222
Synonyms:
(+/-)-7-(dipropylamino)-5,6,7,8-tetrahydronaphthalen-2-ol (R,S) 7-Dipropylamino-5,6,7,8-tetrahydro-naphthalen-2-ol 7-Dipropylamino-5,6,7,8-tetrahydro-naphthalen-2-ol 7-OH-DPAT 7-OH-DPAT,(-) CHEMBL1255966 | CHEMBL285755
Type:
Small organic molecule
Emp. Form.:
C16H25NO
Mol. Mass.:
247.3758
SMILES:
CCCN(CCC)C1CCc2ccc(O)cc2C1
: