Target
5-hydroxytryptamine receptor 6
Ligand
BDBM10755
Substrate
Meas. Tech.
ChEMBL_610399 (CHEMBL1073455)
IC50
27.5±n/a nM
Citation
 Haydar, SNYun, HAndrae, PMMattes, JZhang, JKramer, ASmith, DLHuselton, CGraf, RAschmies, SSchechter, LEComery, TARobichaud, AJ 5-Cyclic amine-3-arylsulfonylindazoles as novel 5-HT6 receptor antagonists. J Med Chem 53:2521-7 (2010)  
Target
Name:
5-hydroxytryptamine receptor 6
Synonyms:
5-HT-6 5-hydroxytryptamine receptor 6 (5-HT-6) 5-hydroxytryptamine receptor 6 (5HT6) HTR6 Serotonin 6 (5-HT6) receptor | Serotonin Receptor 6
Type:
G Protein-Coupled Receptor (GPCR)
Mol. Mass.:
46968.43
Organism:
Homo sapiens (Human)
Description:
P50406
Residue:
440
  
Inhibitor
Name:
BDBM10755
Synonyms:
14C-5-hydroxy tryptamine creatinine disulfate 5-HT 5-hydroxy tryptamine creatinine disulfate Serotonin | [3H]-5-HT
Type:
Small organic molecule
Emp. Form.:
C10H12N2O
Mol. Mass.:
176.2151
SMILES:
NCCc1c[nH]c2ccc(O)cc12
: