Target
Transporter
Ligand
BDBM50308250
Substrate
Meas. Tech.
ChEMBL_613774 (CHEMBL1068921)
Ki
0.135±n/a nM
Citation
 Micheli, FCavanni, PArban, RBenedetti, RBertani, BBettati, MBettelini, LBonanomi, GBraggio, SChecchia, ADavalli, SDi Fabio, RFazzolari, EFontana, SMarchioro, CMinick, DNegri, MOliosi, BRead, KDSartori, ITedesco, GTarsi, LTerreni, SVisentini, FZocchi, AZonzini, L 1-(Aryl)-6-[alkoxyalkyl]-3-azabicyclo[3.1.0]hexanes and 6-(aryl)-6-[alkoxyalkyl]-3-azabicyclo[3.1.0]hexanes: a new series of potent and selective triple reuptake inhibitors. J Med Chem 53:2534-51 (2010)  
Target
Name:
Transporter
Synonyms:
NE transporter Norepinephrine transporter(NET)
Type:
Multi-pass membrane protein
Mol. Mass.:
69236.90
Organism:
Rattus norvegicus (rat)
Description:
Q63380
Residue:
617
  
Inhibitor
Name:
BDBM50308250
Synonyms:
(1R,5R,6R)-1-(3,4-dichlorophenyl)-6-(ethoxymethyl)-3-azabicyclo[3.1.0]hexane | CHEMBL598826
Type:
Small organic molecule
Emp. Form.:
C14H17Cl2NO
Mol. Mass.:
286.197
SMILES:
CCOC[C@@H]1[C@H]2CNC[C@@]12c1ccc(Cl)c(Cl)c1
: