Target
Prostaglandin G/H synthase 1
Ligand
BDBM11639
Substrate
Meas. Tech.
ChEMBL_607533 (CHEMBL1070809)
IC50
5100±n/a nM
Citation
 Biava, MPorretta, GCPoce, GBattilocchio, CManetti, FBotta, MForli, SSautebin, LRossi, APergola, CGhelardini, CGaleotti, NMakovec, FGiordani, AAnzellotti, PPatrignani, PAnzini, M Novel ester and acid derivatives of the 1,5-diarylpyrrole scaffold as anti-inflammatory and analgesic agents. Synthesis and in vitro and in vivo biological evaluation. J Med Chem 53:723-33 (2010)  
Target
Name:
Prostaglandin G/H synthase 1
Synonyms:
Cox-1 Cyclooxygenase-1 PGH1_MOUSE PHS 1 Prostaglandin H2 synthase 1 Ptgs1
Type:
PROTEIN
Mol. Mass.:
69044.61
Organism:
Mus musculus
Description:
ChEMBL_10575
Residue:
602
  
Inhibitor
Name:
BDBM11639
Synonyms:
4-[5-(4-methylphenyl)-3-(trifluoromethyl)-1H-pyrazol-1-yl]benzene-1-sulfonamide CLX Celecoxib US11478464, Compound Celecoxib US8741944, Comparative Compound cid_2662
Type:
Small organic molecule
Emp. Form.:
C17H14F3N3O2S
Mol. Mass.:
381.372
SMILES:
Cc1ccc(cc1)-c1cc(nn1-c1ccc(cc1)S(N)(=O)=O)C(F)(F)F
: