Target
72 kDa type IV collagenase
Ligand
BDBM50308806
Substrate
Meas. Tech.
ChEMBL_607645 (CHEMBL1071044)
IC50
8611400±n/a nM
Citation
 Mou, JFang, HLiu, YShang, LWang, QZhang, LXu, W Design, synthesis and primary activity assay of bi- or tri-peptide analogues with the scaffold l-arginine as amino-peptidase N/CD13 inhibitors. Bioorg Med Chem 18:887-95 (2010)  
Target
Name:
72 kDa type IV collagenase
Synonyms:
72 kDa gelatinase CLG4A Gelatinase A (MMP-2) MMP2_HUMAN Matrix metalloproteinase-2 (MMP 2) Matrix metalloproteinases 2 (MMP-2) | TBE-1
Type:
Enzyme
Mol. Mass.:
73870.36
Organism:
Homo sapiens (Human)
Description:
P08253
Residue:
660
  
Inhibitor
Name:
BDBM50308806
Synonyms:
(S)-N-((S)-1-(Hydroxyamino)-5-(3-nitroguanidino)-1-oxopentan-2-yl)-1-((S)-pyrrolidine-2-carbonyl)pyrrolidine-2-carboxamide | CHEMBL603241
Type:
Small organic molecule
Emp. Form.:
C16H28N8O6
Mol. Mass.:
428.4435
SMILES:
NC(NCCC[C@H](NC(=O)[C@@H]1CCCN1C(=O)[C@@H]1CCCN1)C(=O)NO)=N[N+]([O-])=O
: