Target
Fatty-acid amide hydrolase 1 [30-579]
Ligand
BDBM50161518
Substrate
Meas. Tech.
ChEMBL_611783 (CHEMBL1066440)
IC50
9±n/a nM
Citation
 Forster, LLudwig, JKaptur, MBovens, SElfringhoff, ASHoltfrerich, ALehr, M 1-Indol-1-yl-propan-2-ones and related heterocyclic compounds as dual inhibitors of cytosolic phospholipase A(2)alpha and fatty acid amide hydrolase. Bioorg Med Chem 18:945-52 (2010)  
Target
Name:
Fatty-acid amide hydrolase 1 [30-579]
Synonyms:
Anandamide amidohydrolase 1 Faah Fatty Acid Amide Hydrolase Fatty-acid amide hydrolase (FAAH) Fatty-acid amide hydrolase 1 (FAAH) Oleamide hydrolase 1
Type:
Single-pass membrane protein; homodimer
Mol. Mass.:
60474.00
Organism:
Rattus norvegicus (rat)
Description:
P97612 (aa 30-579)
Residue:
550
  
Inhibitor
Name:
BDBM50161518
Synonyms:
1-(oxazolo[4,5-b]pyridin-2-yl)-6-phenylhexan-1-one CHEMBL175854
Type:
Small organic molecule
Emp. Form.:
C18H18N2O2
Mol. Mass.:
294.3477
SMILES:
O=C(CCCCCc1ccccc1)c1nc2ncccc2o1
: