Target
5-hydroxytryptamine receptor 2C
Ligand
BDBM50001915
Substrate
Meas. Tech.
ChEMBL_609152 (CHEMBL1067826)
EC50
15±n/a nM
Citation
 Ahmad, SNgu, KMiller, KJWu, GHung, CPMalmstrom, SZhang, GO'Tanyi, EKeim, WJCullen, MJRohrbach, KWThomas, MUng, TQu, QGan, JNarayanan, RPelleymounter, MARobl, JA Tricyclic dihydroquinazolinones as novel 5-HT2C selective and orally efficacious anti-obesity agents. Bioorg Med Chem Lett 20:1128-33 (2010)  
Target
Name:
5-hydroxytryptamine receptor 2C
Synonyms:
5-HT-2C 5-HT2C-INI 5-HTR2C 5-hydroxytryptamine receptor 2C (5-HT-2C) 5HT-1C HTR1C Serotonin (5-HT3) receptor Serotonin Receptor 2C
Type:
G Protein-Coupled Receptor (GPCR)
Mol. Mass.:
51836.79
Organism:
Homo sapiens (Human)
Description:
P28335
Residue:
458
  
Inhibitor
Name:
BDBM50001915
Synonyms:
1-(3-chlorophenyl)piperazine m-Chlorophenylpiperazine | mCPP
Type:
Small organic molecule
Emp. Form.:
C10H13ClN2
Mol. Mass.:
196.677
SMILES:
Clc1cccc(c1)N1CCNCC1
: