Target
Prostaglandin D2 receptor 2
Ligand
BDBM50309399
Substrate
Meas. Tech.
ChEMBL_609465 (CHEMBL1069759)
IC50
3.7±n/a nM
Citation
 Rist, ØGrimstrup, MReceveur, JMFrimurer, TMUlven, TKostenis, EHögberg, T Novel selective thiazoleacetic acids as CRTH2 antagonists developed from in silico derived hits. Part 1. Bioorg Med Chem Lett 20:1177-80 (2010)  
Target
Name:
Prostaglandin D2 receptor 2
Synonyms:
CD_antigen=CD294 Chemoattractant Receptor-homologous molecule expressed on T-helper type 2 cells (CRTH2) Chemoattractant receptor-homologous molecule expressed on Th2 cells (CRTH2) G protein-coupled receptor 44 GPR44 PTGDR2 Prostaglandin D2 receptor 2 | Prostaglandin D2 receptor 2 (PGD2)
Type:
Enzyme
Mol. Mass.:
43295.45
Organism:
Homo sapiens (Human)
Description:
Q9Y5Y4
Residue:
395
  
Inhibitor
Name:
BDBM50309399
Synonyms:
2-(2-(4-chlorobenzyl)-4-(4-phenoxyphenyl)thiazol-5-yl)acetic acid | CHEMBL603158
Type:
Small organic molecule
Emp. Form.:
C24H18ClNO3S
Mol. Mass.:
435.923
SMILES:
OC(=O)Cc1sc(Cc2ccc(Cl)cc2)nc1-c1ccc(Oc2ccccc2)cc1
: