Target
Adenosine receptor A3
Ligand
BDBM50309480
Substrate
Meas. Tech.
ChEMBL_609499 (CHEMBL1071771)
EC50
44±n/a nM
Citation
 Beattie, DBrearley, ABrown, ZCharlton, SJCox, BFairhurst, RAFozard, JRGedeck, PKirkham, PMeja, KNanson, LNeef, JOakman, HSpooner, GTaylor, RJTurner, RJWest, RWoodward, H Synthesis and evaluation of two series of 4'-aza-carbocyclic nucleosides as adenosine A2A receptor agonists. Bioorg Med Chem Lett 20:1219-24 (2010)  
Target
Name:
Adenosine receptor A3
Synonyms:
A3 adenosine receptor (hA3) ADORA3 | Adenosine A3 receptor (A3AR)
Type:
G Protein-Coupled Receptor (GPCR)
Mol. Mass.:
36197.32
Organism:
Homo sapiens (Human)
Description:
P0DMS8
Residue:
318
  
Inhibitor
Name:
BDBM50309480
Synonyms:
CHEMBL591356 | N-((2S,3S,4R,5R)-5-(6-(2,2-diphenylethylamino)-2-(2-(1-ethyl-1H-imidazol-4-yl)ethylamino)-9H-purin-9-yl)-3,4-dihydroxytetrahydrofuran-2-yl)propionamide
Type:
Small organic molecule
Emp. Form.:
C34H41N9O3
Mol. Mass.:
623.7478
SMILES:
CCC(=O)N[C@H]1C[C@H]([C@H](O)[C@@H]1O)n1cnc2c(NCC(c3ccccc3)c3ccccc3)nc(NCCc3cn(CC)cn3)nc12
: