Target
Adenosine receptor A2a
Ligand
BDBM50309492
Substrate
Meas. Tech.
ChEMBL_609496 (CHEMBL1071768)
Ki
38±n/a nM
Citation
 Beattie, DBrearley, ABrown, ZCharlton, SJCox, BFairhurst, RAFozard, JRGedeck, PKirkham, PMeja, KNanson, LNeef, JOakman, HSpooner, GTaylor, RJTurner, RJWest, RWoodward, H Synthesis and evaluation of two series of 4'-aza-carbocyclic nucleosides as adenosine A2A receptor agonists. Bioorg Med Chem Lett 20:1219-24 (2010)  
Target
Name:
Adenosine receptor A2a
Synonyms:
A2A adenosine receptor (hA2A) ADENOSINE A2 ADORA2 Adenosine A2A receptor (A2AAR)
Type:
G Protein-Coupled Receptor (GPCR)
Mol. Mass.:
44716.46
Organism:
Homo sapiens (Human)
Description:
P29274
Residue:
412
  
Inhibitor
Name:
BDBM50309492
Synonyms:
(2R,3R,4S,5S)-2-(6-(2,2-diphenylethylamino)-2-(2-(1-isopropyl-1H-imidazol-4-yl)ethylamino)-9H-purin-9-yl)-5-(5-methyl-1H-tetrazol-1-yl)tetrahydrofuran-3,4-diol | CHEMBL601732
Type:
Small organic molecule
Emp. Form.:
C34H40N12O2
Mol. Mass.:
648.7606
SMILES:
CC(C)n1cnc(CCNc2nc(NCC(c3ccccc3)c3ccccc3)c3ncn([C@@H]4C[C@@H]([C@@H](O)[C@H]4O)n4nnnc4C)c3n2)c1
: