Target
Adenosine receptor A3
Ligand
BDBM50309784
Substrate
Meas. Tech.
ChEMBL_611122 (CHEMBL1068772)
Ki
22.3±n/a nM
Citation
 Tosh, DKChinn, MYoo, LSKang, DWLuecke, HGao, ZGJacobson, KA 2-Dialkynyl derivatives of (N)-methanocarba nucleosides: 'Clickable' A(3) adenosine receptor-selective agonists. Bioorg Med Chem 18:508-17 (2010)  
Target
Name:
Adenosine receptor A3
Synonyms:
A3 adenosine receptor (hA3) ADORA3 | Adenosine A3 receptor (A3AR)
Type:
G Protein-Coupled Receptor (GPCR)
Mol. Mass.:
36197.32
Organism:
Homo sapiens (Human)
Description:
P0DMS8
Residue:
318
  
Inhibitor
Name:
BDBM50309784
Synonyms:
(1S,2R,3S,4R,5S)-6-(3-Chlorobenzylamino)-(2-(6-(1-(4-acetamidoethyl)-1H-1,2,3-triazol-4-yl)hex-1-ynyl)-9H-purin-9-yl)-2',3'-dihydroxybicyclo[3.1.0]hexane-1'-carboxylic acid N-methylamide | CHEMBL589263
Type:
Small organic molecule
Emp. Form.:
C32H37ClN10O4
Mol. Mass.:
661.154
SMILES:
CNC(=O)[C@@]12C[C@@H]1[C@H]([C@H](O)[C@@H]2O)n1cnc2c(NCc3cccc(Cl)c3)nc(nc12)C#CCCCCc1cn(CCNC(C)=O)nn1
: