Target
Adenosine receptor A2a
Ligand
BDBM50309785
Substrate
Meas. Tech.
ChEMBL_610881 (CHEMBL1065036)
Ki
1630±n/a nM
Citation
 Tosh, DKChinn, MYoo, LSKang, DWLuecke, HGao, ZGJacobson, KA 2-Dialkynyl derivatives of (N)-methanocarba nucleosides: 'Clickable' A(3) adenosine receptor-selective agonists. Bioorg Med Chem 18:508-17 (2010)  
Target
Name:
Adenosine receptor A2a
Synonyms:
A2A adenosine receptor (hA2A) ADENOSINE A2 ADORA2 Adenosine A2A receptor (A2AAR)
Type:
G Protein-Coupled Receptor (GPCR)
Mol. Mass.:
44716.46
Organism:
Homo sapiens (Human)
Description:
P29274
Residue:
412
  
Inhibitor
Name:
BDBM50309785
Synonyms:
(1S,2R,3S,4R,5S)-6-(3-Chlorobenzylamino)-(2-(6-(1-(4-aminobutyl)-1H-1,2,3-triazol-4-yl)hex-1-ynyl)-9H-purin-9-yl)-2',3'-dihydroxybicyclo[3.1.0]hexane-1'-carboxylic acid N-methylamide | CHEMBL602846
Type:
Small organic molecule
Emp. Form.:
C32H39ClN10O3
Mol. Mass.:
647.17
SMILES:
CNC(=O)[C@@]12C[C@@H]1[C@H]([C@H](O)[C@@H]2O)n1cnc2c(NCc3cccc(Cl)c3)nc(nc12)C#CCCCCc1cn(CCCCN)nn1
: