Target
Histamine H3 receptor
Ligand
BDBM50309848
Substrate
Meas. Tech.
ChEMBL_611486 (CHEMBL1069468)
Ki
3±n/a nM
Citation
 Cole, DCGross, JLComery, TAAschmies, SHirst, WDKelley, CKim, JIKubek, KNing, XPlatt, BJRobichaud, AJSolvibile, WRStock, JRTawa, GWilliams, MJEllingboe, JW Benzimidazole- and indole-substituted 1,3'-bipyrrolidine benzamides as histamine H3 receptor antagonists. Bioorg Med Chem Lett 20:1237-40 (2010)  
Target
Name:
Histamine H3 receptor
Synonyms:
G-protein coupled receptor 97 HH3R HRH3 Histamine H3 receptor (H3) Histamine receptor (H3 and H4)
Type:
G Protein-Coupled Receptor (GPCR)
Mol. Mass.:
48691.47
Organism:
Homo sapiens (Human)
Description:
Binding assays were using CHO cells stably expressing hH3R receptors.
Residue:
445
  
Inhibitor
Name:
BDBM50309848
Synonyms:
(R)-1,3'-bipyrrolidin-1'-yl(4-((2-methyl-1H-benzo[d]imidazol-1-yl)methyl)phenyl)methanone | CHEMBL605140
Type:
Small organic molecule
Emp. Form.:
C24H28N4O
Mol. Mass.:
388.5053
SMILES:
Cc1nc2ccccc2n1Cc1ccc(cc1)C(=O)N1CC[C@H](C1)N1CCCC1
: