Target
5-hydroxytryptamine receptor 3A
Ligand
BDBM50309863
Substrate
Meas. Tech.
ChEMBL_611799 (CHEMBL1066456)
Ki
3.9±n/a nM
Citation
 O'Donnell, CJRogers, BNBronk, BSBryce, DKCoe, JWCook, KKDuplantier, AJEvrard, EHajós, MHoffmann, WEHurst, RSMaklad, NMather, RJMcLean, SNedza, FMO'Neill, BTPeng, LQian, WRottas, MMSands, SBSchmidt, AWShrikhande, AVSpracklin, DKWong, DFZhang, AZhang, L Discovery of 4-(5-methyloxazolo[4,5-b]pyridin-2-yl)-1,4-diazabicyclo[3.2.2]nonane (CP-810,123), a novel alpha 7 nicotinic acetylcholine receptor agonist for the treatment of cognitive disorders in schizophrenia: synthesis, SAR development, and in vivo efficacy in cognition models. J Med Chem 53:1222-37 (2010)  
Target
Name:
5-hydroxytryptamine receptor 3A
Synonyms:
5-HT-3 5-HT3A 5-HT3R 5-hydroxytryptamine receptor 3A 5ht3 Htr3a Serotonin 3a (5-HT3a) receptor Serotonin-gated ion channel receptor
Type:
Mol. Mass.:
56056.00
Organism:
Mus musculus (house mouse)
Description:
5HT3A
Residue:
487
  
Inhibitor
Name:
BDBM50309863
Synonyms:
4-(5-Fluorobenzoxazol-2-yl)-1,4-diazabicyclo[3.2.2]nonane | CHEMBL598873
Type:
Small organic molecule
Emp. Form.:
C14H16FN3O
Mol. Mass.:
261.2947
SMILES:
Fc1ccc2oc(nc2c1)N1CCN2CCC1CC2
: