Target
Prostaglandin G/H synthase 2
Ligand
BDBM50309952
Substrate
Meas. Tech.
ChEMBL_612170 (CHEMBL1074165)
IC50
11100±n/a nM
Citation
 Yu, GChowdhury, MAAbdellatif, KRDong, YPraveen Rao, PNDas, DVelázquez, CASuresh, MRKnaus, EE Phenylacetic acid regioisomers possessing a N-difluoromethyl-1,2-dihydropyrid-2-one pharmacophore: evaluation as dual inhibitors of cyclooxygenases and 5-lipoxygenase with anti-inflammatory activity. Bioorg Med Chem Lett 20:896-902 (2010)  
Target
Name:
Prostaglandin G/H synthase 2
Synonyms:
COX2 Cyclooxygenase 2 (COX-2) Cyclooxygenase-2 (COX-2 AA) Cyclooxygenase-2 (COX-2) PGH2_HUMAN PHS II Prostaglandin E synthase/G/H synthase 2 Prostaglandin-endoperoxide synthase 2
Type:
Enzyme
Mol. Mass.:
69003.89
Organism:
Homo sapiens (Human)
Description:
Recombinant Cox-2 provided by Cayman (Cayman Chemical Co.,Ann Arbor, MI).
Residue:
604
  
Inhibitor
Name:
BDBM50309952
Synonyms:
2-(3-(1-(difluoromethyl)-2-oxo-1,2-dihydropyridin-4-yl)phenyl)acetic acid | CHEMBL610493
Type:
Small organic molecule
Emp. Form.:
C14H11F2NO3
Mol. Mass.:
279.2388
SMILES:
OC(=O)Cc1cccc(c1)-c1ccn(C(F)F)c(=O)c1
: