Target
Prostaglandin G/H synthase 1
Ligand
BDBM50309949
Substrate
Meas. Tech.
ChEMBL_612169 (CHEMBL1074164)
IC50
13900±n/a nM
Citation
 Yu, GChowdhury, MAAbdellatif, KRDong, YPraveen Rao, PNDas, DVelázquez, CASuresh, MRKnaus, EE Phenylacetic acid regioisomers possessing a N-difluoromethyl-1,2-dihydropyrid-2-one pharmacophore: evaluation as dual inhibitors of cyclooxygenases and 5-lipoxygenase with anti-inflammatory activity. Bioorg Med Chem Lett 20:896-902 (2010)  
Target
Name:
Prostaglandin G/H synthase 1
Synonyms:
COX1 Cyclooxygenase-1 (COX-1) PTGS1 | Prostaglandin G/H synthase (cyclooxygenase)
Type:
Protein
Mol. Mass.:
68868.60
Organism:
Ovis aries (Sheep)
Description:
Residue:
600
  
Inhibitor
Name:
BDBM50309949
Synonyms:
2-(3-(1-(difluoromethyl)-2-oxo-1,2-dihydropyridin-4-yl)-2-methylphenyl)acetic acid | CHEMBL596888
Type:
Small organic molecule
Emp. Form.:
C15H13F2NO3
Mol. Mass.:
293.2654
SMILES:
Cc1c(CC(O)=O)cccc1-c1ccn(C(F)F)c(=O)c1
: