Target
Seminal ribonuclease
Ligand
BDBM50118239
Substrate
Meas. Tech.
ChEMBL_620093 (CHEMBL1109348)
pH
6±n/a
Ki
1046400±n/a nM
Comments
extracted
Citation
 Dossi, KTsirkone, VGHayes, JMMatousek, JPoucková, PSoucek, JZadinova, MZographos, SELeonidas, DD Mapping the ribonucleolytic active site of bovine seminal ribonuclease. The binding of pyrimidinyl phosphonucleotide inhibitors. Eur J Med Chem 44:4496-508 (2009)  
Target
Name:
Seminal ribonuclease
Synonyms:
RNS_BOVIN | SRN
Type:
PROTEIN
Mol. Mass.:
16390.13
Organism:
Bos taurus
Description:
ChEMBL_620093
Residue:
150
  
Inhibitor
Name:
BDBM50118239
Synonyms:
CHEMBL130266 Uridine diphosphate | uridine 5'-(trihydrogen diphosphate)
Type:
Small organic molecule
Emp. Form.:
C9H14N2O12P2
Mol. Mass.:
404.1612
SMILES:
O[C@@H]1[C@@H](COP(O)(=O)OP(O)(O)=O)O[C@H]([C@@H]1O)n1ccc(=O)[nH]c1=O
: