Target
Receptor-type tyrosine-protein kinase FLT3
Ligand
BDBM50300691
Substrate
Meas. Tech.
ChEMBL_620389 (CHEMBL1112284)
Kd
1.6±n/a nM
Citation
 Patel, HKGrotzfeld, RMLai, AGMehta, SAMilanov, ZVChao, QSprankle, KGCarter, TAVelasco, AMFabian, MAJames, JTreiber, DKLockhart, DJZarrinkar, PPBhagwat, SS Arylcarboxyamino-substituted diaryl ureas as potent and selective FLT3 inhibitors. Bioorg Med Chem Lett 19:5182-5 (2009)  
Target
Name:
Receptor-type tyrosine-protein kinase FLT3
Synonyms:
CD135 FL cytokine receptor FLK2 FLT3 Fetal liver kinase-2 Fms-like tyrosine kinase 3 (Flt-3) STK-1 Stem cell tyrosine kinase 1
Type:
Enzyme
Mol. Mass.:
112888.62
Organism:
Homo sapiens (Human)
Description:
P36888
Residue:
993
  
Inhibitor
Name:
BDBM50300691
Synonyms:
Benzo[d]imidazo[2,1-b]thiazole-2-carboxylic acid {4-[3-(5-tert-butyl-isoxazol-3-yl)-ureido]-phenyl}-amide CHEMBL575925
Type:
Small organic molecule
Emp. Form.:
C24H22N6O3S
Mol. Mass.:
474.535
SMILES:
CC(C)(C)c1cc(NC(=O)Nc2ccc(NC(=O)c3cn4c(n3)sc3ccccc43)cc2)no1
: