Target
Platelet-derived growth factor receptor beta
Ligand
BDBM50310637
Substrate
Meas. Tech.
ChEMBL_620396 (CHEMBL1112291)
Kd
2.6±n/a nM
Citation
 Patel, HKGrotzfeld, RMLai, AGMehta, SAMilanov, ZVChao, QSprankle, KGCarter, TAVelasco, AMFabian, MAJames, JTreiber, DKLockhart, DJZarrinkar, PPBhagwat, SS Arylcarboxyamino-substituted diaryl ureas as potent and selective FLT3 inhibitors. Bioorg Med Chem Lett 19:5182-5 (2009)  
Target
Name:
Platelet-derived growth factor receptor beta
Synonyms:
Beta-type platelet-derived growth factor receptor CD140b antigen PDGF Receptor Substrate PDGFR PDGFR-1 PDGFRB PGFRB_HUMAN Platelet-derived growth factor receptor 1 Platelet-derived growth factor receptor beta (PDGFR-beta) Platelet-derived growth factor receptor beta (PDGFRbeta) | VHL/PDGFRB
Type:
Enzyme
Mol. Mass.:
123922.25
Organism:
Homo sapiens (Human)
Description:
P09619
Residue:
1106
  
Inhibitor
Name:
BDBM50310637
Synonyms:
CHEMBL1079545 | N-(4-(3-(5-tert-butylisoxazol-3-yl)ureido)phenyl)-3-hydroxypicolinamide
Type:
Small organic molecule
Emp. Form.:
C20H21N5O4
Mol. Mass.:
395.4118
SMILES:
CC(C)(C)c1cc(NC(=O)Nc2ccc(NC(=O)c3ncccc3O)cc2)no1
: