Target
Somatostatin receptor type 5
Ligand
BDBM50311365
Substrate
Meas. Tech.
ChEMBL_621599 (CHEMBL1113031)
Ki
33±n/a nM
Citation
 Martin, REMohr, PMaerki, HPGuba, WKuratli, CGavelle, OBinggeli, ABendels, SAlvarez-Sánchez, RAlker, APolonchuk, LChrist, AD Benzoxazole piperidines as selective and potent somatostatin receptor subtype 5 antagonists. Bioorg Med Chem Lett 19:6106-13 (2009)  
Target
Name:
Somatostatin receptor type 5
Synonyms:
SOMATOSTATIN SST5 SS5-R SSR5_HUMAN Somatostatin receptor type 5 (SSTR5)
Type:
Enzyme
Mol. Mass.:
39218.02
Organism:
Homo sapiens (Human)
Description:
P35346
Residue:
364
  
Inhibitor
Name:
BDBM50311365
Synonyms:
CHEMBL1078449 | N-(1-(4-amino-3,5-diethoxybenzyl)piperidin-4-yl)benzo[d]oxazol-2-amine
Type:
Small organic molecule
Emp. Form.:
C23H30N4O3
Mol. Mass.:
410.5093
SMILES:
CCOc1cc(CN2CCC(CC2)Nc2nc3ccccc3o2)cc(OCC)c1N
: