Target
Low molecular weight protein-tyrosine phosphatase A
Ligand
BDBM50075308
Substrate
Meas. Tech.
ChEMBL_621991 (CHEMBL1106782)
Ki
>100000±n/a nM
Citation
 Rawls, KALang, PTTakeuchi, JImamura, SBaguley, TDGrundner, CAlber, TEllman, JA Fragment-based discovery of selective inhibitors of the Mycobacterium tuberculosis protein tyrosine phosphatase PtpA. Bioorg Med Chem Lett 19:6851-4 (2009)  
Target
Name:
Low molecular weight protein-tyrosine phosphatase A
Synonyms:
PTPA_MYCTU Probable low molecular weight protein-tyrosine-phosphatase mptpA | ptpA
Type:
Hydrolase
Mol. Mass.:
17891.84
Organism:
Mycobacterium tuberculosis
Description:
Residue:
163
  
Inhibitor
Name:
BDBM50075308
Synonyms:
(Biphenyl-4-yl-difluoro-methyl)-phosphonic acid biphenyl-4-yldifluoromethylphosphonic acid
Type:
Small organic molecule
Emp. Form.:
C13H11F2O3P
Mol. Mass.:
284.1952
SMILES:
OP(O)(=O)C(F)(F)c1ccc(cc1)-c1ccccc1
: