Target
Low molecular weight protein-tyrosine phosphatase A
Ligand
BDBM50312234
Substrate
Meas. Tech.
ChEMBL_621991 (CHEMBL1106782)
Ki
84400±n/a nM
Citation
 Rawls, KALang, PTTakeuchi, JImamura, SBaguley, TDGrundner, CAlber, TEllman, JA Fragment-based discovery of selective inhibitors of the Mycobacterium tuberculosis protein tyrosine phosphatase PtpA. Bioorg Med Chem Lett 19:6851-4 (2009)  
Target
Name:
Low molecular weight protein-tyrosine phosphatase A
Synonyms:
PTPA_MYCTU Probable low molecular weight protein-tyrosine-phosphatase mptpA | ptpA
Type:
Hydrolase
Mol. Mass.:
17891.84
Organism:
Mycobacterium tuberculosis
Description:
Residue:
163
  
Inhibitor
Name:
BDBM50312234
Synonyms:
(2-benzyl-2H-indazol-5-yl)difluoromethylphosphonic acid | CHEMBL1079662
Type:
Small organic molecule
Emp. Form.:
C15H13F2N2O3P
Mol. Mass.:
338.2459
SMILES:
OP(O)(=O)C(F)(F)c1ccc2nn(Cc3ccccc3)cc2c1
: