Target
Cannabinoid receptor 1
Ligand
BDBM50312588
Substrate
Meas. Tech.
ChEMBL_615551 (CHEMBL1107820)
Ki
3.1±n/a nM
Citation
 Meng, TWang, JPeng, HFang, GLi, MXiong, BXie, XZhang, YWang, XShen, J Discovery of benzhydrylpiperazine derivatives as CB1 receptor inverse agonists via privileged structure-based approach. Eur J Med Chem 45:1133-9 (2010)  
Target
Name:
Cannabinoid receptor 1
Synonyms:
CANN6 CB-R CNR CNR1_HUMAN Cannabinoid receptor Cannabinoid receptor 1 (brain)
Type:
G Protein-Coupled Receptor (GPCR)
Mol. Mass.:
52868.96
Organism:
Homo sapiens (Human)
Description:
P21554
Residue:
472
  
Inhibitor
Name:
BDBM50312588
Synonyms:
4-[(2-fluoro-4-chlorophenyl)(phenyl)methyl]-N-cyclohexylpiperazine-1-carboxamide | CHEMBL1088161
Type:
Small organic molecule
Emp. Form.:
C24H29ClFN3O
Mol. Mass.:
429.958
SMILES:
Fc1cc(Cl)ccc1C(N1CCN(CC1)C(=O)NC1CCCCC1)c1ccccc1
: