Target
Cannabinoid receptor 1
Ligand
BDBM50312600
Substrate
Meas. Tech.
ChEMBL_615551 (CHEMBL1107820)
Ki
3±n/a nM
Citation
 Meng, TWang, JPeng, HFang, GLi, MXiong, BXie, XZhang, YWang, XShen, J Discovery of benzhydrylpiperazine derivatives as CB1 receptor inverse agonists via privileged structure-based approach. Eur J Med Chem 45:1133-9 (2010)  
Target
Name:
Cannabinoid receptor 1
Synonyms:
CANN6 CB-R CNR CNR1_HUMAN Cannabinoid receptor Cannabinoid receptor 1 (brain)
Type:
G Protein-Coupled Receptor (GPCR)
Mol. Mass.:
52868.96
Organism:
Homo sapiens (Human)
Description:
P21554
Residue:
472
  
Inhibitor
Name:
BDBM50312600
Synonyms:
4-[(2,4-Dichlorophenyl)(p-tolyl)methyl]-N-piperidin-1-ylpiperazine-1-carboxamide | CHEMBL1091812
Type:
Small organic molecule
Emp. Form.:
C24H30Cl2N4O
Mol. Mass.:
461.427
SMILES:
Cc1ccc(cc1)C(N1CCN(CC1)C(=O)NN1CCCCC1)c1ccc(Cl)cc1Cl
: