Target
Cannabinoid receptor 2
Ligand
BDBM50312598
Substrate
Meas. Tech.
ChEMBL_615552 (CHEMBL1107821)
Ki
407±n/a nM
Citation
 Meng, TWang, JPeng, HFang, GLi, MXiong, BXie, XZhang, YWang, XShen, J Discovery of benzhydrylpiperazine derivatives as CB1 receptor inverse agonists via privileged structure-based approach. Eur J Med Chem 45:1133-9 (2010)  
Target
Name:
Cannabinoid receptor 2
Synonyms:
CANNABINOID CB2 CB2 CB2B CNR2_HUMAN Cannabinoid CB2 receptor Cannabinoid receptor 2 (CB2R) | hCB2
Type:
G Protein-Coupled Receptor (GPCR)
Mol. Mass.:
39690.94
Organism:
Homo sapiens (Human)
Description:
P34972
Residue:
360
  
Inhibitor
Name:
BDBM50312598
Synonyms:
4-[(3-chlorophenyl)(2,4-dichlorophenyl)methyl]-N-cyclohexylpiperazine-1-carboxamide | CHEMBL1093378
Type:
Small organic molecule
Emp. Form.:
C24H28Cl3N3O
Mol. Mass.:
480.858
SMILES:
Clc1ccc(C(N2CCN(CC2)C(=O)NC2CCCCC2)c2cccc(Cl)c2)c(Cl)c1
: