Target
Cannabinoid receptor 2
Ligand
BDBM50312838
Substrate
Meas. Tech.
ChEMBL_615859 (CHEMBL1101969)
Ki
4.5±n/a nM
Citation
 Fujinaga, MKumata, KYanamoto, KKawamura, KYamasaki, TYui, JHatori, AOgawa, MYoshida, YNengaki, NMaeda, JZhang, MR Radiosynthesis of novel carbon-11-labeled triaryl ligands for cannabinoid-type 2 receptor. Bioorg Med Chem Lett 20:1565-8 (2010)  
Target
Name:
Cannabinoid receptor 2
Synonyms:
CANNABINOID CB2 CB2 CB2B CNR2_HUMAN Cannabinoid CB2 receptor Cannabinoid receptor 2 (CB2R) | hCB2
Type:
G Protein-Coupled Receptor (GPCR)
Mol. Mass.:
39690.94
Organism:
Homo sapiens (Human)
Description:
P34972
Residue:
360
  
Inhibitor
Name:
BDBM50312838
Synonyms:
CHEMBL1081623 [11C]N-(1-(4-(4-methoxy-2-(4-methoxyphenylsulfonyl)phenylsulfonyl)phenyl)ethyl)methanesulfonamide
Type:
Small organic molecule
Emp. Form.:
C23H25NO8S3
Mol. Mass.:
539.642
SMILES:
COc1ccc(cc1)S(=O)(=O)c1cc(OC)ccc1S(=O)(=O)c1ccc(cc1)C(C)NS(C)(=O)=O
: