Target
Cholinesterase
Ligand
BDBM50312899
Substrate
Meas. Tech.
ChEMBL_615895 (CHEMBL1102909)
IC50
370±n/a nM
Citation
 Takahashi, JHijikuro, IKihara, TMurugesh, MGFuse, STsumura, YAkaike, ANiidome, TTakahashi, TSugimoto, H Design, synthesis and evaluation of carbamate-modified (-)-N(1)-phenethylnorphysostigmine derivatives as selective butyrylcholinesterase inhibitors. Bioorg Med Chem Lett 20:1721-3 (2010)  
Target
Name:
Cholinesterase
Synonyms:
Acylcholine acylhydrolase Butyrylcholine esterase CHLE_MOUSE Pseudocholinesterase
Type:
Protein
Mol. Mass.:
68465.99
Organism:
Mus musculus (Mouse)
Description:
Q03311
Residue:
603
  
Inhibitor
Name:
BDBM50312899
Synonyms:
3alpha,8-dimethyl-1-phenethyl-1,2,3,3alpha,8,8alpha-hexahydropyrrolo[2,3-b]indol-5-yl4-chlorophenylcarbamate | CHEMBL1079797
Type:
Small organic molecule
Emp. Form.:
C27H28ClN3O2
Mol. Mass.:
461.983
SMILES:
CN1[C@H]2N(CCc3ccccc3)CC[C@@]2(C)c2cc(OC(=O)Nc3ccc(Cl)cc3)ccc12
: