Target
Cholinesterase
Ligand
BDBM50014113
Substrate
Meas. Tech.
ChEMBL_615895 (CHEMBL1102909)
IC50
10±n/a nM
Citation
 Takahashi, JHijikuro, IKihara, TMurugesh, MGFuse, STsumura, YAkaike, ANiidome, TTakahashi, TSugimoto, H Design, synthesis and evaluation of carbamate-modified (-)-N(1)-phenethylnorphysostigmine derivatives as selective butyrylcholinesterase inhibitors. Bioorg Med Chem Lett 20:1721-3 (2010)  
Target
Name:
Cholinesterase
Synonyms:
Acylcholine acylhydrolase Butyrylcholine esterase CHLE_MOUSE Pseudocholinesterase
Type:
Protein
Mol. Mass.:
68465.99
Organism:
Mus musculus (Mouse)
Description:
Q03311
Residue:
603
  
Inhibitor
Name:
BDBM50014113
Synonyms:
3alpha,8-dimethyl-1-phenethyl-1,2,3,3alpha,8,8alpha-hexahydropyrrolo[2,3-b]indol-5-ylmethylcarbamate Methyl-carbamic acid 3a,8-dimethyl-1-phenethyl-1,2,3,3a,8,8a-hexahydro-pyrrolo[2,3-b]indol-5-yl ester
Type:
Small organic molecule
Emp. Form.:
C22H27N3O2
Mol. Mass.:
365.4687
SMILES:
CNC(=O)Oc1ccc2N(C)[C@H]3N(CCc4ccccc4)CC[C@@]3(C)c2c1
: