Target
Adenosine receptor A2b
Ligand
BDBM50312947
Substrate
Meas. Tech.
ChEMBL_616078 (CHEMBL1102041)
Ki
41±n/a nM
Citation
 Eastwood, PGonzalez, JParedes, SNueda, ADomenech, TAlberti, JVidal, B Discovery of N-(5,6-diarylpyridin-2-yl)amide derivatives as potent and selective A(2B) adenosine receptor antagonists. Bioorg Med Chem Lett 20:1697-700 (2010)  
Target
Name:
Adenosine receptor A2b
Synonyms:
AA2BR_HUMAN ADORA2B Adenosine receptors A2b | Adenosine receptors; A2a & A2b
Type:
G Protein-Coupled Receptor (GPCR)
Mol. Mass.:
36341.22
Organism:
Homo sapiens (Human)
Description:
Residue:
332
  
Inhibitor
Name:
BDBM50312947
Synonyms:
CHEMBL1079801 | N-(5-cyano-6-(furan-2-yl)pyridin-2-yl)cyclopropanecarboxamide
Type:
Small organic molecule
Emp. Form.:
C14H11N3O2
Mol. Mass.:
253.256
SMILES:
O=C(Nc1ccc(C#N)c(n1)-c1ccco1)C1CC1
: