Target
Adenosine receptor A1
Ligand
BDBM50312959
Substrate
Meas. Tech.
ChEMBL_616080 (CHEMBL1102043)
Ki
14±n/a nM
Citation
 Eastwood, PGonzalez, JParedes, SNueda, ADomenech, TAlberti, JVidal, B Discovery of N-(5,6-diarylpyridin-2-yl)amide derivatives as potent and selective A(2B) adenosine receptor antagonists. Bioorg Med Chem Lett 20:1697-700 (2010)  
Target
Name:
Adenosine receptor A1
Synonyms:
A1 adenosine receptor (hA1) AA1R_HUMAN ADORA1 Adenosine A1-receptor Adenosine receptor A1 (hA1) | Adenosine transporter (AdT)
Type:
G Protein-Coupled Receptor (GPCR)
Mol. Mass.:
36520.92
Organism:
Homo sapiens (Human)
Description:
P30542
Residue:
326
  
Inhibitor
Name:
BDBM50312959
Synonyms:
CHEMBL1076587 | N-(2-(3-fluorophenyl)-3,4'-bipyridin-6-yl)cyclopropanecarboxamide
Type:
Small organic molecule
Emp. Form.:
C20H16FN3O
Mol. Mass.:
333.3589
SMILES:
Fc1cccc(c1)-c1nc(NC(=O)C2CC2)ccc1-c1ccncc1
: