Target
Sphingosine 1-phosphate receptor 1
Ligand
BDBM50314402
Substrate
Meas. Tech.
ChEMBL_624580 (CHEMBL1110629)
EC50
0.018±n/a nM
Citation
 Ma, BGuckian, KMLin, EYLee, WCScott, DKumaravel, GMacdonald, TLLynch, KRBlack, CChollate, SHahm, KHetu, GJin, PLuo, YRohde, ERossomando, AScannevin, RWang, JYang, C Stereochemistry-activity relationship of orally active tetralin S1P agonist prodrugs. Bioorg Med Chem Lett 20:2264-9 (2010)  
Target
Name:
Sphingosine 1-phosphate receptor 1
Synonyms:
CHEDG1 Endothelial differentiation G-protein coupled receptor 1 S1P1 S1PR1_HUMAN Sphingosine 1-phosphate receptor Edg-1
Type:
Enzyme
Mol. Mass.:
42836.02
Organism:
Homo sapiens (Human)
Description:
P21453
Residue:
382
  
Inhibitor
Name:
BDBM50314402
Synonyms:
(R)-2-amino-2-((S)-6-octyl-1,2,3,4-tetrahydronaphthalen-2-yl)propyl dihydrogen phosphate | CHEMBL1093686
Type:
Small organic molecule
Emp. Form.:
C21H36NO4P
Mol. Mass.:
397.4886
SMILES:
CCCCCCCCc1ccc2C[C@H](CCc2c1)[C@@](C)(N)COP(O)(O)=O
: