Target
Sphingosine 1-phosphate receptor 3
Ligand
BDBM50314401
Substrate
Meas. Tech.
ChEMBL_624584 (CHEMBL1111544)
EC50
18.8±n/a nM
Citation
 Ma, BGuckian, KMLin, EYLee, WCScott, DKumaravel, GMacdonald, TLLynch, KRBlack, CChollate, SHahm, KHetu, GJin, PLuo, YRohde, ERossomando, AScannevin, RWang, JYang, C Stereochemistry-activity relationship of orally active tetralin S1P agonist prodrugs. Bioorg Med Chem Lett 20:2264-9 (2010)  
Target
Name:
Sphingosine 1-phosphate receptor 3
Synonyms:
C9orf108 EDG3 S1P receptor 3 S1P3 S1PR3_HUMAN Sphingosine 1-phosphate receptor 3 (S1P3) | Sphingosine 1-phosphate receptor Edg-3
Type:
G Protein-Coupled Receptor (GPCR)
Mol. Mass.:
42278.13
Organism:
Homo sapiens (Human)
Description:
Q99500
Residue:
378
  
Inhibitor
Name:
BDBM50314401
Synonyms:
2-amino-3-hydroxy-2-((R)-6-octyl-1,2,3,4-tetrahydronaphthalen-2-yl)propyl dihydrogen phosphate | CHEMBL1091103
Type:
Small organic molecule
Emp. Form.:
C21H36NO5P
Mol. Mass.:
413.488
SMILES:
CCCCCCCCc1ccc2C[C@@H](CCc2c1)C(N)(CO)COP(O)(O)=O
: