Target
Death-associated protein kinase 3
Ligand
BDBM50314675
Substrate
Meas. Tech.
ChEMBL_625624 (CHEMBL1112575)
IC50
533.5±n/a nM
Citation
 Okamoto, MTakayama, KShimizu, TMuroya, AFuruya, T Structure-activity relationship of novel DAPK inhibitors identified by structure-based virtual screening. Bioorg Med Chem 18:2728-34 (2010)  
Target
Name:
Death-associated protein kinase 3
Synonyms:
DAP kinase 3 DAPK3 ZIP-kinase | ZIPK
Type:
PROTEIN
Mol. Mass.:
52537.07
Organism:
Homo sapiens (Human)
Description:
ChEMBL_586564
Residue:
454
  
Inhibitor
Name:
BDBM50314675
Synonyms:
2-(4-methyl-3-nitrophenyl)-4-(pyridin-3-ylmethylene)oxazol-5(4H)-one | CHEMBL1094005
Type:
Small organic molecule
Emp. Form.:
C16H11N3O4
Mol. Mass.:
309.2762
SMILES:
Cc1ccc(cc1[N+]([O-])=O)C1=N\C(=C/c2cccnc2)C(=O)O1
: