Target
Acetyl-CoA carboxylase 1
Ligand
BDBM50314904
Substrate
Meas. Tech.
ChEMBL_627703 (CHEMBL1115283)
IC50
7.5±n/a nM
Citation
 Corbett, JWFreeman-Cook, KDElliott, RVajdos, FRajamohan, FKohls, DMarr, EZhang, HTong, LTu, MMurdande, SDoran, SDHouser, JASong, WJones, CJCoffey, SBBuzon, LMinich, MLDirico, KJTapley, SMcPherson, RKSugarman, EHarwood, HJEsler, W Discovery of small molecule isozyme non-specific inhibitors of mammalian acetyl-CoA carboxylase 1 and 2. Bioorg Med Chem Lett 20:2383-8 (2010)  
Target
Name:
Acetyl-CoA carboxylase 1
Synonyms:
ACACA_RAT Acac Acetyl-CoA carboxylase Acetyl-CoA carboxylase 1 (ACC1)
Type:
Protein
Mol. Mass.:
265183.92
Organism:
Rattus norvegicus (Rat)
Description:
P11497
Residue:
2345
  
Inhibitor
Name:
BDBM50314904
Synonyms:
1'-(7-methyl-1H-indazole-5-carbonyl)-6-(1-methyl-1H-pyrazol-4-yl)spiro[chroman-2,4'-piperidin]-4-one | CHEMBL1092580
Type:
Small organic molecule
Emp. Form.:
C26H25N5O3
Mol. Mass.:
455.5084
SMILES:
Cc1cc(cc2cn[nH]c12)C(=O)N1CCC2(CC1)CC(=O)c1cc(ccc1O2)-c1cnn(C)c1
: