Target
Beta-secretase 1
Ligand
BDBM50315006
Substrate
Meas. Tech.
ChEMBL_624424 (CHEMBL1108752)
IC50
2450±n/a nM
Citation
 Malamas, MSBarnes, KHui, YJohnson, MLovering, FCondon, JFobare, WSolvibile, WTurner, JHu, YManas, ESFan, KOlland, AChopra, RBard, JPangalos, MNReinhart, PRobichaud, AJ Novel pyrrolyl 2-aminopyridines as potent and selective human beta-secretase (BACE1) inhibitors. Bioorg Med Chem Lett 20:2068-73 (2010)  
Target
Name:
Beta-secretase 1
Synonyms:
ASP2 Aspartyl protease 2 BACE1 Beta-secretase (BACE) Beta-secretase 1 (BACE 1) Beta-secretase 1 (BACE1) Beta-site amyloid precursor protein cleaving enzyme 1 Memapsin-2 beta-Secretase (BACE-1) | beta-Secretase (BACE1)
Type:
Protein
Mol. Mass.:
55755.10
Organism:
Homo sapiens (Human)
Description:
P56817
Residue:
501
  
Inhibitor
Name:
BDBM50315006
Synonyms:
6-((2-(2-chlorophenyl)-5-(4-methoxyphenyl)-1H-pyrrol-1-yl)methyl)pyridin-2-amine | CHEMBL1093152
Type:
Small organic molecule
Emp. Form.:
C23H20ClN3O
Mol. Mass.:
389.877
SMILES:
COc1ccc(cc1)-c1ccc(-c2ccccc2Cl)n1Cc1cccc(N)n1
: