Target
Beta-secretase 2
Ligand
BDBM50314995
Substrate
Meas. Tech.
ChEMBL_624428 (CHEMBL1108756)
IC50
1000±n/a nM
Citation
 Malamas, MSBarnes, KHui, YJohnson, MLovering, FCondon, JFobare, WSolvibile, WTurner, JHu, YManas, ESFan, KOlland, AChopra, RBard, JPangalos, MNReinhart, PRobichaud, AJ Novel pyrrolyl 2-aminopyridines as potent and selective human beta-secretase (BACE1) inhibitors. Bioorg Med Chem Lett 20:2068-73 (2010)  
Target
Name:
Beta-secretase 2
Synonyms:
AEPLC ASP1 Asp 1 Aspartyl protease 1 BACE2_HUMAN Beta-secretase (BACE) Beta-secretase 2 (BACE-2) Beta-site APP-cleaving enzyme 2 Memapsin-1 beta-Secretase (BACE-2)
Type:
Protein
Mol. Mass.:
56171.20
Organism:
Homo sapiens (Human)
Description:
Q9Y5Z0
Residue:
518
  
Inhibitor
Name:
BDBM50314995
Synonyms:
2-(2-amino-6-((2-(2-chlorophenyl)-5-(4-(pentyloxy)phenyl)-1H-pyrrol-1-yl)methyl)pyridin-3-ylamino)ethanol | CHEMBL1089186
Type:
Small organic molecule
Emp. Form.:
C29H33ClN4O2
Mol. Mass.:
505.051
SMILES:
CCCCCOc1ccc(cc1)-c1ccc(-c2ccccc2Cl)n1Cc1ccc(NCCO)c(N)n1
: