Target
Histamine H1 receptor
Ligand
BDBM50315184
Substrate
Meas. Tech.
ChEMBL_625162 (CHEMBL1115183)
Ki
12±n/a nM
Citation
 Li, BFMoree, WJYu, JCoon, TZamani-Kord, SMalany, SJalali, KWen, JWang, HYang, CHoare, SRPetroski, REMadan, ACrowe, PDBeaton, G Selectivity profiling of novel indene H(1)-antihistamines for the treatment of insomnia. Bioorg Med Chem Lett 20:2629-33 (2010)  
Target
Name:
Histamine H1 receptor
Synonyms:
H1R HISTAMINE H1 HRH1_HUMAN
Type:
G Protein-Coupled Receptor (GPCR)
Mol. Mass.:
55808.72
Organism:
Homo sapiens (Human)
Description:
Cell pellets from SK-N-MC cells transfected with human H1 receptor were used in binding assay.
Residue:
487
  
Inhibitor
Name:
BDBM50315184
Synonyms:
CHEMBL1088882 | N,N-dimethyl-2-(3-((6-methylpyrazin-2-yl)methyl)-1H-inden-2-yl)ethanamine
Type:
Small organic molecule
Emp. Form.:
C19H23N3
Mol. Mass.:
293.406
SMILES:
CN(C)CCC1=C(Cc2cncc(C)n2)c2ccccc2C1
: