Target
Potassium voltage-gated channel subfamily H member 2
Ligand
BDBM50315206
Substrate
Meas. Tech.
ChEMBL_625166 (CHEMBL1115187)
Ki
1200±n/a nM
Citation
 Li, BFMoree, WJYu, JCoon, TZamani-Kord, SMalany, SJalali, KWen, JWang, HYang, CHoare, SRPetroski, REMadan, ACrowe, PDBeaton, G Selectivity profiling of novel indene H(1)-antihistamines for the treatment of insomnia. Bioorg Med Chem Lett 20:2629-33 (2010)  
Target
Name:
Potassium voltage-gated channel subfamily H member 2
Synonyms:
1,3-beta-glucan synthase component GLS2 ERG Eag-related protein 1 Ether-a-go-go-related gene (HERG) Ether-a-go-go-related gene potassium channel 1 Ether-a-go-go-related gene potassium channel 1 (hERG1) Ether-a-go-go-related protein 1 H-ERG KCNH2 Potassium voltage-gated channel subfamily H member 2 (hERG) Voltage-gated potassium channel subunit Kv11.1 hERG Potassium Channel 1 | putative potassium channel subunit
Type:
Multi-pass membrane protein
Mol. Mass.:
126672.65
Organism:
Homo sapiens (Human)
Description:
Q12809
Residue:
1159
  
Inhibitor
Name:
BDBM50315206
Synonyms:
(R)-2-(6-fluoro-3-(1-(thiazol-2-yl)ethyl)-1H-inden-2-yl)-N,N-dimethylethanamine | CHEMBL1090527
Type:
Small organic molecule
Emp. Form.:
C18H21FN2S
Mol. Mass.:
316.436
SMILES:
C[C@H](C1=C(CCN(C)C)Cc2cc(F)ccc12)c1nccs1
: