Target
Potassium voltage-gated channel subfamily H member 2
Ligand
BDBM50315192
Substrate
Meas. Tech.
ChEMBL_625166 (CHEMBL1115187)
Ki
>3000±n/a nM
Citation
 Li, BFMoree, WJYu, JCoon, TZamani-Kord, SMalany, SJalali, KWen, JWang, HYang, CHoare, SRPetroski, REMadan, ACrowe, PDBeaton, G Selectivity profiling of novel indene H(1)-antihistamines for the treatment of insomnia. Bioorg Med Chem Lett 20:2629-33 (2010)  
Target
Name:
Potassium voltage-gated channel subfamily H member 2
Synonyms:
1,3-beta-glucan synthase component GLS2 ERG Eag-related protein 1 Ether-a-go-go-related gene (HERG) Ether-a-go-go-related gene potassium channel 1 Ether-a-go-go-related gene potassium channel 1 (hERG1) Ether-a-go-go-related protein 1 H-ERG KCNH2 Potassium voltage-gated channel subfamily H member 2 (hERG) Voltage-gated potassium channel subunit Kv11.1 hERG Potassium Channel 1 | putative potassium channel subunit
Type:
Multi-pass membrane protein
Mol. Mass.:
126672.65
Organism:
Homo sapiens (Human)
Description:
Q12809
Residue:
1159
  
Inhibitor
Name:
BDBM50315192
Synonyms:
(R)-N,N-dimethyl-2-(3-(1-(4-methylthiazol-2-yl)ethyl)-1H-inden-2-yl)ethanamine | CHEMBL1092599
Type:
Small organic molecule
Emp. Form.:
C19H24N2S
Mol. Mass.:
312.472
SMILES:
C[C@H](C1=C(CCN(C)C)Cc2ccccc12)c1nc(C)cs1
: