Target
Toll-like receptor 7
Ligand
BDBM50315259
Substrate
Meas. Tech.
ChEMBL_625707 (CHEMBL1103537)
EC50
51.5±n/a nM
Citation
 Kurimoto, AHashimoto, KNakamura, TNorimura, KOgita, HTakaku, HBonnert, RMcInally, TWada, HIsobe, Y Synthesis and biological evaluation of 8-oxoadenine derivatives as toll-like receptor 7 agonists introducing the antedrug concept. J Med Chem 53:2964-72 (2010)  
Target
Name:
Toll-like receptor 7
Synonyms:
ORF Names:UNQ248/PRO285 TLR7_HUMAN | Toll-like receptor 7 (TLR7)
Type:
Enzyme
Mol. Mass.:
120945.35
Organism:
Homo sapiens (Human)
Description:
Q9NYK1
Residue:
1049
  
Inhibitor
Name:
BDBM50315259
Synonyms:
CHEMBL1089863 | Methyl 3-[(6-amino-2-butoxy-8-oxo-7,8-dihydro-9H-purin-9-yl)methyl]benzoate
Type:
Small organic molecule
Emp. Form.:
C18H21N5O4
Mol. Mass.:
371.3904
SMILES:
CCCCOc1nc(N)c2[nH]c(=O)n(Cc3cccc(c3)C(=O)OC)c2n1
: