Target
Ribosomal protein S6 kinase beta-1
Ligand
BDBM50316350
Substrate
Meas. Tech.
ChEMBL_627906 (CHEMBL1103722)
IC50
88±n/a nM
Citation
 Nittoli, TDushin, RGIngalls, CCheung, KFloyd, MBFraser, HOlland, AHu, YGrosu, GHan, XArndt, KGuo, BWissner, A The identification of 8,9-dimethoxy-5-(2-aminoalkoxy-pyridin-3-yl)-benzo[c][2,7]naphthyridin-4-ylamines as potent inhibitors of 3-phosphoinositide-dependent kinase-1 (PDK-1). Eur J Med Chem 45:1379-86 (2010)  
Target
Name:
Ribosomal protein S6 kinase beta-1
Synonyms:
70 kDa ribosomal protein S6 kinase 1 70 kDa ribosomal protein kinase (p70S6K) Protein kinase 70S6K (T412E) RPS6KB1 Ribosomal protein S6 kinase I STK14A p70S6K1
Type:
Enzyme
Mol. Mass.:
59139.89
Organism:
Homo sapiens (Human)
Description:
His-tagged S6K1.
Residue:
525
  
Inhibitor
Name:
BDBM50316350
Synonyms:
2-(5-{[(2R)-2-Amino-3-phenylpropyl]oxy}pyridin-3-yl)-8,9-dimethoxybenzo[c]-2,7-naphthyridin-4-amine CHEMBL1095294
Type:
Small organic molecule
Emp. Form.:
C28H27N5O3
Mol. Mass.:
481.5457
SMILES:
COc1cc2ncc3c(N)nc(cc3c2cc1OC)-c1cncc(OC[C@H](N)Cc2ccccc2)c1
: