Target
Fructose-1,6-bisphosphatase 1
Ligand
BDBM18137
Substrate
Meas. Tech.
ChEMBL_628629 (CHEMBL1106395)
IC50
1300±n/a nM
Citation
 Heng, SHarris, KMKantrowitz, ER Designing inhibitors against fructose 1,6-bisphosphatase: exploring natural products for novel inhibitor scaffolds. Eur J Med Chem 45:1478-84 (2010)  
Target
Name:
Fructose-1,6-bisphosphatase 1
Synonyms:
F16P1_PIG FBP1 Fructose-1,6-bisphosphatase 1 (FBPase)
Type:
Protein
Mol. Mass.:
36781.07
Organism:
Sus scrofa (Pig)
Description:
Liver FBPase (P00636)
Residue:
338
  
Inhibitor
Name:
BDBM18137
Synonyms:
AMP US11185100, TABLE 7.3 adenosine 5 -monophosphate | {[(2R,3S,4R,5R)-5-(6-amino-9H-purin-9-yl)-3,4-dihydroxyoxolan-2-yl]methoxy}phosphonic acid
Type:
Nucleoside or nucleotide
Emp. Form.:
C10H14N5O7P
Mol. Mass.:
347.2212
SMILES:
Nc1ncnc2n(cnc12)[C@@H]1O[C@H](COP(O)(O)=O)[C@@H](O)[C@H]1O
: