Target
5-hydroxytryptamine receptor 1A
Ligand
BDBM50316676
Substrate
Meas. Tech.
ChEMBL_632234 (CHEMBL1110096)
IC50
7±n/a nM
Citation
 Childers, WEHavran, LMAsselin, MBicksler, JJChong, DCGrosu, GTShen, ZAbou-Gharbia, MABach, ACHarrison, BLKagan, NKleintop, TMagolda, RMarathias, VRobichaud, AJSabb, ALZhang, MYAndree, THAschmies, SHBeyer, CComery, TADay, MGrauer, SMHughes, ZARosenzweig-Lipson, SPlatt, BPulicicchio, CSmith, DESukoff-Rizzo, SJSullivan, KMAdedoyin, AHuselton, CHirst, WD The synthesis and biological evaluation of quinolyl-piperazinyl piperidines as potent serotonin 5-HT1A antagonists. J Med Chem 53:4066-84 (2010)  
Target
Name:
5-hydroxytryptamine receptor 1A
Synonyms:
5-HT-1A 5-hydroxytryptamine receptor 1A (5-HT-1A) ADRB2RL1 Dopamine D2 receptor and serotonin 1a receptor HTR1A | Serotonin receptor 1A
Type:
Mol. Mass.:
46122.49
Organism:
Homo sapiens (Human)
Description:
Residue:
422
  
Inhibitor
Name:
BDBM50316676
Synonyms:
5-Fluoro-8-{4-[4-(6-methoxyquinolin-8-yl)piperazin-1-yl]piperidin-1-yl}-2-(trifluoromethyl)-quinoline | CHEMBL1097484
Type:
Small organic molecule
Emp. Form.:
C29H29F4N5O
Mol. Mass.:
539.5671
SMILES:
COc1cc(N2CCN(CC2)C2CCN(CC2)c2ccc(F)c3ccc(nc23)C(F)(F)F)c2ncccc2c1
: